Reaction Details
TargetCyclin-dependent kinase 1
LigandBDBM50113707
Substrate/Competitorn/a
Meas. Tech.ChEMBL_563812 (CHEMBL994324)
IC50 7000±n/a nM
Citation Gray, NSWodicka, LThunnissen, AMNorman, TCKwon, SEspinoza, FHMorgan, DOBarnes, GLeClerc, SMeijer, LKim, SHLockhart, DJSchultz, PG Exploiting chemical libraries, structure, and genomics in the search for kinase inhibitors. Science281:533-538 (1998) Cyclin-dependent kinase 1
Name:Cyclin-dependent kinase 1
Type:PROTEIN
Mol. Mass.:34067.63
Organism:Saccharomyces cerevisiae
Description:ChEMBL_563811
Residue:298
BDBM50113707
NameBDBM50113707
Synonyms:2,6,9-Trisubstitute purine, 2 2-[6-(3-Chloro-phenylamino)-9-isopropyl-9H-purin-2-ylamino]-ethanol | CHEMBL311228
TypeSmall organic molecule
Emp. Form.C16H19ClN6O
Mol. Mass.346.815
SMILESCC(C)n1cnc2c(Nc3cccc(Cl)c3)nc(NCCO)nc12