Reaction Details
TargetSerine/threonine-protein kinase KIN28
LigandBDBM50113707
Substrate/Competitorn/a
Meas. Tech.ChEMBL_563814 (CHEMBL994326)
IC50>500000±n/a nM
Citation Gray, NSWodicka, LThunnissen, AMNorman, TCKwon, SEspinoza, FHMorgan, DOBarnes, GLeClerc, SMeijer, LKim, SHLockhart, DJSchultz, PG Exploiting chemical libraries, structure, and genomics in the search for kinase inhibitors. Science281:533-538 (1998) Serine/threonine-protein kinase KIN28
Name:Serine/threonine-protein kinase KIN28
Type:PROTEIN
Mol. Mass.:35248.03
Organism:Saccharomyces cerevisiae
Description:ChEMBL_563814
Residue:306
BDBM50113707
NameBDBM50113707
Synonyms:2,6,9-Trisubstitute purine, 2 2-[6-(3-Chloro-phenylamino)-9-isopropyl-9H-purin-2-ylamino]-ethanol | CHEMBL311228
TypeSmall organic molecule
Emp. Form.C16H19ClN6O
Mol. Mass.346.815
SMILESCC(C)n1cnc2c(Nc3cccc(Cl)c3)nc(NCCO)nc12