Reaction Details
TargetProtein kinase C epsilon type
LigandBDBM27216
Substrate/Competitorn/a
Meas. Tech.ChEMBL_564066 (CHEMBL962521)
IC50>100000±n/a nM
Citation Gray, NSWodicka, LThunnissen, AMNorman, TCKwon, SEspinoza, FHMorgan, DOBarnes, GLeClerc, SMeijer, LKim, SHLockhart, DJSchultz, PG Exploiting chemical libraries, structure, and genomics in the search for kinase inhibitors. Science281:533-538 (1998) Protein kinase C epsilon type
Name:Protein kinase C epsilon type
Type:Enzyme
Mol. Mass.:83680.45
Organism:Homo sapiens (Human)
Description:The recombinant human PKC enzymes were produced using a baculovirus expression system in SF9 cells
Residue:737
BDBM27216
NameBDBM27216
Synonyms:(2R)-2-({6-[(3-chlorophenyl)amino]-9-(propan-2-yl)-9H-purin-2-yl}amino)-3-methylbutan-1-ol CHEMBL23327 | Purvalanol A
TypeSmall organic molecule
Emp. Form.C19H25ClN6O
Mol. Mass.388.894
SMILESCC(C)[C@H](CO)Nc1nc(Nc2cccc(Cl)c2)c2ncn(C(C)C)c2n1