Reaction Details
TargetCyclin-dependent kinase 4
LigandBDBM7478
Substrate/Competitorn/a
Meas. Tech.ChEMBL_563796 (CHEMBL994308)
IC50>10000±n/a nM
Citation Gray, NSWodicka, LThunnissen, AMNorman, TCKwon, SEspinoza, FHMorgan, DOBarnes, GLeClerc, SMeijer, LKim, SHLockhart, DJSchultz, PG Exploiting chemical libraries, structure, and genomics in the search for kinase inhibitors. Science281:533-538 (1998) Cyclin-dependent kinase 4
Name:Cyclin-dependent kinase 4
Type:Enzyme Subunit
Mol. Mass.:33731.96
Organism:Homo sapiens (Human)
Description:P11802
Residue:303
BDBM7478
NameBDBM7478
Synonyms:2-chloro-4-[(2-{[(1R)-1-(hydroxymethyl)-2-methylpropyl]amino}-9-isopropyl-9H-purin-6-yl)amino]benzoic acid CHEMBL23254 | Purvalanol B
TypeSmall organic molecule
Emp. Form.C20H25ClN6O3
Mol. Mass.432.904
SMILESCC(C)[C@H](CO)Nc1nc(Nc2ccc(C(O)=O)c(Cl)c2)c2ncn(C(C)C)c2n1