Reaction Details
TargetProtein kinase C epsilon type
LigandBDBM7478
Substrate/Competitorn/a
Meas. Tech.ChEMBL_564066 (CHEMBL962521)
IC50>100000±n/a nM
Citation Gray, NSWodicka, LThunnissen, AMNorman, TCKwon, SEspinoza, FHMorgan, DOBarnes, GLeClerc, SMeijer, LKim, SHLockhart, DJSchultz, PG Exploiting chemical libraries, structure, and genomics in the search for kinase inhibitors. Science281:533-538 (1998) Protein kinase C epsilon type
Name:Protein kinase C epsilon type
Type:Enzyme
Mol. Mass.:83680.45
Organism:Homo sapiens (Human)
Description:The recombinant human PKC enzymes were produced using a baculovirus expression system in SF9 cells
Residue:737
BDBM7478
NameBDBM7478
Synonyms:2-chloro-4-[(2-{[(1R)-1-(hydroxymethyl)-2-methylpropyl]amino}-9-isopropyl-9H-purin-6-yl)amino]benzoic acid CHEMBL23254 | Purvalanol B
TypeSmall organic molecule
Emp. Form.C20H25ClN6O3
Mol. Mass.432.904
SMILESCC(C)[C@H](CO)Nc1nc(Nc2ccc(C(O)=O)c(Cl)c2)c2ncn(C(C)C)c2n1