Reaction Details
TargetTranslocator protein
LigandBDBM22032
Substrate/Competitorn/a
Meas. Tech.ChEMBL_563773 (CHEMBL993536)
Ki 0.31±n/a nM
Citation Yanamoto, KKumata, KYamasaki, TOdawara, CKawamura, KYui, JHatori, ASuzuki, KZhang, MR [18F]FEAC and [18F]FEDAC: Two novel positron emission tomography ligands for peripheral-type benzodiazepine receptor in the brain. Bioorg Med Chem Lett19:1707-10 (2009) 
 
Translocator protein
Name:Translocator protein
Type:Mitochondrion membrane protein
Mol. Mass.:18945.84
Organism:Rattus norvegicus (rat)
Description:Competitive binding experiments were performed on rat kidney mitochondrial membranes.
Residue:169
BDBM22032
NameBDBM22032
Synonyms:1-(2-chlorophenyl)-N-methyl-N-(1-methylpropyl)isoquinoline-3-carboxamide N-(butan-2-yl)-1-(2-chlorophenyl)-N-methylisoquinoline-3-carboxamide PK-11195 RP 52028 | [3H]PK 11195
Typeradiolabeled ligand
Emp. Form.C21H21ClN2O
Mol. Mass.352.857
SMILESCCC(C)N(C)C(=O)c1cc2ccccc2c(n1)-c1ccccc1Cl