Reaction Details
TargetCannabinoid receptor 2
LigandBDBM50278520
Substrate/Competitorn/a
Meas. Tech.ChEMBL_565045 (CHEMBL959188)
Ki>10000±n/a nM
Citation Behrenswerth, AVolz, NToräng, JHinz, SBräse, SMüller, CE Synthesis and pharmacological evaluation of coumarin derivatives as cannabinoid receptor antagonists and inverse agonists. Bioorg Med Chem17:2842-51 (2009) 
 
Cannabinoid receptor 2
Name:Cannabinoid receptor 2
Type:G Protein-Coupled Receptor (GPCR)
Mol. Mass.:39690.94
Organism:Homo sapiens (Human)
Description:P34972
Residue:360
BDBM50278520
NameBDBM50278520
Synonyms:1-(6-(1,3-dithiolan-2-yl)-2,2-dimethyl-2H-chromen-5-yl) 3-ethyl 2-(3-phenylallylidene)malonate | CHEMBL512509
TypeSmall organic molecule
Emp. Form.C28H28O5S2
Mol. Mass.508.649
SMILESCCOC(=O)C(=C\C=C\c1ccccc1)\C(=O)Oc1c(ccc2OC(C)(C)C=Cc12)C1SCCS1