Reaction Details
TargetCannabinoid receptor 2
LigandBDBM50278517
Substrate/Competitorn/a
Meas. Tech.ChEMBL_565045 (CHEMBL959188)
Ki>10000±n/a nM
Citation Behrenswerth, AVolz, NToräng, JHinz, SBräse, SMüller, CE Synthesis and pharmacological evaluation of coumarin derivatives as cannabinoid receptor antagonists and inverse agonists. Bioorg Med Chem17:2842-51 (2009) 
 
Cannabinoid receptor 2
Name:Cannabinoid receptor 2
Type:G Protein-Coupled Receptor (GPCR)
Mol. Mass.:39690.94
Organism:Homo sapiens (Human)
Description:P34972
Residue:360
BDBM50278517
NameBDBM50278517
Synonyms:2,2-dimethyl-8-phenyl-2H-chromene-3-carbaldehyde | CHEMBL472068
TypeSmall organic molecule
Emp. Form.C18H16O2
Mol. Mass.264.3184
SMILESCC1(C)Oc2c(C=C1C=O)cccc2-c1ccccc1