Reaction Details
TargetCannabinoid receptor 2
LigandBDBM50278476
Substrate/Competitorn/a
Meas. Tech.ChEMBL_565045 (CHEMBL959188)
Ki>10000±n/a nM
Citation Behrenswerth, AVolz, NToräng, JHinz, SBräse, SMüller, CE Synthesis and pharmacological evaluation of coumarin derivatives as cannabinoid receptor antagonists and inverse agonists. Bioorg Med Chem17:2842-51 (2009) 
 
Cannabinoid receptor 2
Name:Cannabinoid receptor 2
Type:G Protein-Coupled Receptor (GPCR)
Mol. Mass.:39690.94
Organism:Homo sapiens (Human)
Description:P34972
Residue:360
BDBM50278476
NameBDBM50278476
Synonyms:5-Isopropyl-3,8-dimethylchromen-2-one | CHEMBL506746
TypeSmall organic molecule
Emp. Form.C14H16O2
Mol. Mass.216.2756
SMILESCC(C)c1ccc(C)c2oc(=O)c(C)cc12