Reaction Details
TargetCannabinoid receptor 2
LigandBDBM50278381
Substrate/Competitorn/a
Meas. Tech.ChEMBL_565045 (CHEMBL959188)
Ki 4760±n/a nM
Citation Behrenswerth, AVolz, NToräng, JHinz, SBräse, SMüller, CE Synthesis and pharmacological evaluation of coumarin derivatives as cannabinoid receptor antagonists and inverse agonists. Bioorg Med Chem17:2842-51 (2009) 
 
Cannabinoid receptor 2
Name:Cannabinoid receptor 2
Type:G Protein-Coupled Receptor (GPCR)
Mol. Mass.:39690.94
Organism:Homo sapiens (Human)
Description:P34972
Residue:360
BDBM50278381
NameBDBM50278381
Synonyms:5-Methoxy-7-methyl-3-(4-methylbenzyl)-2H-chromen-2-one | CHEMBL470619
TypeSmall organic molecule
Emp. Form.C19H18O3
Mol. Mass.294.3444
SMILESCOc1cc(C)cc2oc(=O)c(Cc3ccc(C)cc3)cc12