Reaction Details
TargetCannabinoid receptor 2
LigandBDBM50278326
Substrate/Competitorn/a
Meas. Tech.ChEMBL_565045 (CHEMBL959188)
Ki>10000±n/a nM
Citation Behrenswerth, AVolz, NToräng, JHinz, SBräse, SMüller, CE Synthesis and pharmacological evaluation of coumarin derivatives as cannabinoid receptor antagonists and inverse agonists. Bioorg Med Chem17:2842-51 (2009) 
 
Cannabinoid receptor 2
Name:Cannabinoid receptor 2
Type:G Protein-Coupled Receptor (GPCR)
Mol. Mass.:39690.94
Organism:Homo sapiens (Human)
Description:P34972
Residue:360
BDBM50278326
NameBDBM50278326
Synonyms:3-Benzyl-6-methoxychromen-2-one | CHEMBL511303
TypeSmall organic molecule
Emp. Form.C17H14O3
Mol. Mass.266.2913
SMILESCOc1ccc2oc(=O)c(Cc3ccccc3)cc2c1