Reaction Details
TargetCannabinoid receptor 1
LigandBDBM50278476
Substrate/Competitorn/a
Meas. Tech.ChEMBL_565043 (CHEMBL959186)
Ki>10000±n/a nM
Citation Behrenswerth, AVolz, NToräng, JHinz, SBräse, SMüller, CE Synthesis and pharmacological evaluation of coumarin derivatives as cannabinoid receptor antagonists and inverse agonists. Bioorg Med Chem17:2842-51 (2009) 
 
Cannabinoid receptor 1
Name:Cannabinoid receptor 1
Type:G Protein-Coupled Receptor (GPCR)
Mol. Mass.:52856.55
Organism:Rattus norvegicus (rat)
Description:P20272
Residue:473
BDBM50278476
NameBDBM50278476
Synonyms:5-Isopropyl-3,8-dimethylchromen-2-one | CHEMBL506746
TypeSmall organic molecule
Emp. Form.C14H16O2
Mol. Mass.216.2756
SMILESCC(C)c1ccc(C)c2oc(=O)c(C)cc12