Reaction Details
TargetCannabinoid receptor 1
LigandBDBM50278475
Substrate/Competitorn/a
Meas. Tech.ChEMBL_565043 (CHEMBL959186)
Ki 2760±n/a nM
Citation Behrenswerth, AVolz, NToräng, JHinz, SBräse, SMüller, CE Synthesis and pharmacological evaluation of coumarin derivatives as cannabinoid receptor antagonists and inverse agonists. Bioorg Med Chem17:2842-51 (2009) 
 
Cannabinoid receptor 1
Name:Cannabinoid receptor 1
Type:G Protein-Coupled Receptor (GPCR)
Mol. Mass.:52856.55
Organism:Rattus norvegicus (rat)
Description:P20272
Residue:473
BDBM50278475
NameBDBM50278475
Synonyms:3-Benzyl-5-isopropyl-8-methylchromen-2-one | CHEMBL470224
TypeSmall organic molecule
Emp. Form.C20H20O2
Mol. Mass.292.3716
SMILESCC(C)c1ccc(C)c2oc(=O)c(Cc3ccccc3)cc12