Reaction Details
TargetCannabinoid receptor 1
LigandBDBM50278472
Substrate/Competitorn/a
Meas. Tech.ChEMBL_565043 (CHEMBL959186)
Ki 12300±n/a nM
Citation Behrenswerth, AVolz, NToräng, JHinz, SBräse, SMüller, CE Synthesis and pharmacological evaluation of coumarin derivatives as cannabinoid receptor antagonists and inverse agonists. Bioorg Med Chem17:2842-51 (2009) 
 
Cannabinoid receptor 1
Name:Cannabinoid receptor 1
Type:G Protein-Coupled Receptor (GPCR)
Mol. Mass.:52856.55
Organism:Rattus norvegicus (rat)
Description:P20272
Residue:473
BDBM50278472
NameBDBM50278472
Synonyms:5-Methoxy-3-(2-methoxybenzyl)-8-methyl-2Hchromen-2-one | CHEMBL470017
TypeSmall organic molecule
Emp. Form.C19H18O4
Mol. Mass.310.3438
SMILESCOc1ccccc1Cc1cc2c(OC)ccc(C)c2oc1=O