Reaction Details
TargetCannabinoid receptor 1
LigandBDBM50278380
Substrate/Competitorn/a
Meas. Tech.ChEMBL_565043 (CHEMBL959186)
Ki 1170±n/a nM
Citation Behrenswerth, AVolz, NToräng, JHinz, SBräse, SMüller, CE Synthesis and pharmacological evaluation of coumarin derivatives as cannabinoid receptor antagonists and inverse agonists. Bioorg Med Chem17:2842-51 (2009) 
 
Cannabinoid receptor 1
Name:Cannabinoid receptor 1
Type:G Protein-Coupled Receptor (GPCR)
Mol. Mass.:52856.55
Organism:Rattus norvegicus (rat)
Description:P20272
Residue:473
BDBM50278380
NameBDBM50278380
Synonyms:5-Methoxy-7-methyl-3-(2-methylbenzyl)-2H-chromen-2-one | CHEMBL470618
TypeSmall organic molecule
Emp. Form.C19H18O3
Mol. Mass.294.3444
SMILESCOc1cc(C)cc2oc(=O)c(Cc3ccccc3C)cc12