Reaction Details
TargetCannabinoid receptor 1
LigandBDBM50278329
Substrate/Competitorn/a
Meas. Tech.ChEMBL_565043 (CHEMBL959186)
Ki>10000±n/a nM
Citation Behrenswerth, AVolz, NToräng, JHinz, SBräse, SMüller, CE Synthesis and pharmacological evaluation of coumarin derivatives as cannabinoid receptor antagonists and inverse agonists. Bioorg Med Chem17:2842-51 (2009) 
 
Cannabinoid receptor 1
Name:Cannabinoid receptor 1
Type:G Protein-Coupled Receptor (GPCR)
Mol. Mass.:52856.55
Organism:Rattus norvegicus (rat)
Description:P20272
Residue:473
BDBM50278329
NameBDBM50278329
Synonyms:6-Iodo-3-methyl-chromen-2-one | CHEMBL455557
TypeSmall organic molecule
Emp. Form.C10H7IO2
Mol. Mass.286.0659
SMILESCc1cc2cc(I)ccc2oc1=O