Reaction Details
TargetAurora kinase A
LigandBDBM27087
Substrate/Competitorn/a
Meas. Tech.ChEMBL_501648 (CHEMBL993738)
IC50 3±n/a nM
Citation Pollard, JRMortimore, M Discovery and development of aurora kinase inhibitors as anticancer agents. J Med Chem52:2629-51 (2009) 
 
Aurora kinase A
Name:Aurora kinase A
Type:Serine/threonine-protein kinase
Mol. Mass.:45830.98
Organism:Homo sapiens (Human)
Description:O14965
Residue:403
BDBM27087
NameBDBM27087
Synonyms:3-cyclopropyl-1-{3-[5-(morpholin-4-ylmethyl)-1H-1,3-benzodiazol-2-yl]-1H-pyrazol-4-yl}urea | pyrazole-benzimidazole urea analogue, 16
TypeSmall organic molecule
Emp. Form.C19H23N7O2
Mol. Mass.381.4316
SMILESO=C(NC1CC1)Nc1c[nH]nc1-c1nc2ccc(CN3CCOCC3)cc2[nH]1