Reaction Details
TargetAurora kinase B
LigandBDBM26274
Substrate/Competitorn/a
Meas. Tech.ChEMBL_501649 (CHEMBL993739)
IC50 2±n/a nM
Citation Pollard, JRMortimore, M Discovery and development of aurora kinase inhibitors as anticancer agents. J Med Chem52:2629-51 (2009) 
 
Aurora kinase B
Name:Aurora kinase B
Type:Protein
Mol. Mass.:39327.72
Organism:Homo sapiens (Human)
Description:Q96GD4
Residue:344
BDBM26274
NameBDBM26274
Synonyms:CHEMBL216769 pyrazoloquinazoline deriv., 8
TypeSmall organic molecule
Emp. Form.C29H34FN7O4
Mol. Mass.563.6232
SMILESCOc1cc2c(Nc3cc(CC(=O)Nc4cccc(F)c4)n[nH]3)ncnc2cc1OCCCN1CCC(CO)CC1