Reaction Details
TargetAurora kinase B
LigandBDBM26292
Substrate/Competitorn/a
Meas. Tech.ChEMBL_501649 (CHEMBL993739)
IC50 1±n/a nM
Citation Pollard, JRMortimore, M Discovery and development of aurora kinase inhibitors as anticancer agents. J Med Chem52:2629-51 (2009) 
 
Aurora kinase B
Name:Aurora kinase B
Type:Protein
Mol. Mass.:39327.72
Organism:Homo sapiens (Human)
Description:Q96GD4
Residue:344
BDBM26292
NameBDBM26292
Synonyms:2-{3-[(7-{3-[ethyl(2-hydroxyethyl)amino]propoxy}-6-methoxyquinazolin-4-yl)amino]-1H-pyrazol-5-yl}-N-(3-fluorophenyl)acetamide pyrazoloquinazoline deriv., 26
TypeSmall organic molecule
Emp. Form.C27H32FN7O4
Mol. Mass.537.5859
SMILESCCN(CCO)CCCOc1cc2ncnc(Nc3cc(CC(=O)Nc4cccc(F)c4)n[nH]3)c2cc1OC