Reaction Details
TargetGlycogen synthase kinase-3 beta
LigandBDBM50162083
Substrate/Competitorn/a
Meas. Tech.ChEMBL_501673 (CHEMBL981421)
Ki 22±n/a nM
Citation Pollard, JRMortimore, M Discovery and development of aurora kinase inhibitors as anticancer agents. J Med Chem52:2629-51 (2009) 
 
Glycogen synthase kinase-3 beta
Name:Glycogen synthase kinase-3 beta
Type:Enzyme
Mol. Mass.:46756.38
Organism:Homo sapiens (Human)
Description:P49841
Residue:420
BDBM50162083
NameBDBM50162083
Synonyms:(5-Methyl-1H-pyrazol-3-yl)-(2-phenyl-quinazolin-4-yl)-amine CHEMBL359482 N-(5-METHYL-1H-PYRAZOL-3-YL)-2-PHENYLQUINAZOLIN-4-AMINE
TypeSmall organic molecule
Emp. Form.C18H15N5
Mol. Mass.301.3452
SMILESCc1cc(Nc2nc(nc3ccccc23)-c2ccccc2)[nH]n1