Reaction Details
TargetProto-oncogene tyrosine-protein kinase Src
LigandBDBM50162083
Substrate/Competitorn/a
Meas. Tech.ChEMBL_501674 (CHEMBL981422)
Ki 81±n/a nM
Citation Pollard, JRMortimore, M Discovery and development of aurora kinase inhibitors as anticancer agents. J Med Chem52:2629-51 (2009) 
 
Proto-oncogene tyrosine-protein kinase Src
Name:Proto-oncogene tyrosine-protein kinase Src
Type:Protein
Mol. Mass.:59838.60
Organism:Homo sapiens (Human)
Description:P12931
Residue:536
BDBM50162083
NameBDBM50162083
Synonyms:(5-Methyl-1H-pyrazol-3-yl)-(2-phenyl-quinazolin-4-yl)-amine CHEMBL359482 N-(5-METHYL-1H-PYRAZOL-3-YL)-2-PHENYLQUINAZOLIN-4-AMINE
TypeSmall organic molecule
Emp. Form.C18H15N5
Mol. Mass.301.3452
SMILESCc1cc(Nc2nc(nc3ccccc23)-c2ccccc2)[nH]n1