Reaction Details
TargetAurora kinase B
LigandBDBM26295
Substrate/Competitorn/a
Meas. Tech.ChEMBL_501683 (CHEMBL981431)
IC50 18±n/a nM
Citation Pollard, JRMortimore, M Discovery and development of aurora kinase inhibitors as anticancer agents. J Med Chem52:2629-51 (2009) 
 
Aurora kinase B
Name:Aurora kinase B
Type:Protein
Mol. Mass.:39327.72
Organism:Homo sapiens (Human)
Description:Q96GD4
Residue:344
BDBM26295
NameBDBM26295
Synonyms:CHEMBL214849 pyrazoloquinazoline deriv., 29
TypeSmall organic molecule
Emp. Form.C28H33F2N7O4
Mol. Mass.569.6029
SMILESCCCN(CCO)CCCOc1cc2ncnc(Nc3cc(CC(=O)Nc4cccc(F)c4F)n[nH]3)c2cc1OC