Reaction Details
TargetTyrosine-protein kinase ABL2
LigandBDBM13534
Substrate/Competitorn/a
Meas. Tech.ChEMBL_501691 (CHEMBL981439)
Kd 4±n/a nM
Citation Pollard, JRMortimore, M Discovery and development of aurora kinase inhibitors as anticancer agents. J Med Chem52:2629-51 (2009) 
 
Tyrosine-protein kinase ABL2
Name:Tyrosine-protein kinase ABL2
Type:PROTEIN
Mol. Mass.:128360.63
Organism:Homo sapiens (Human)
Description:ChEMBL_325082
Residue:1182
BDBM13534
NameBDBM13534
Synonyms:CHEMBL572878 N-[4-[[4-(4-methylpiperazino)-6-[(5-methyl-1H-pyrazol-3-yl)amino]pyrimidin-2-yl]thio]phenyl]cyclopropanecarboxamide VX680 | cyclopropane carboxylic acid {4-[4-(4-methyl-piperazin-1-yl)-6-(5-methyl-2H-pyrazol-3-ylamino)-pyrimidin-2ylsulphanyl]-phenyl}-amide
TypeSmall organic molecule
Emp. Form.C23H28N8OS
Mol. Mass.464.586
SMILESCN1CCN(CC1)c1cc(Nc2cc(C)n[nH]2)nc(Sc2ccc(NC(=O)C3CC3)cc2)n1