Reaction Details
TargetAurora kinase A
LigandBDBM12104
Substrate/Competitorn/a
Meas. Tech.ChEMBL_501648 (CHEMBL993738)
IC50 41±n/a nM
Citation Pollard, JRMortimore, M Discovery and development of aurora kinase inhibitors as anticancer agents. J Med Chem52:2629-51 (2009) 
 
Aurora kinase A
Name:Aurora kinase A
Type:Serine/threonine-protein kinase
Mol. Mass.:45830.98
Organism:Homo sapiens (Human)
Description:O14965
Residue:403
BDBM12104
NameBDBM12104
Synonyms:1,4,5,6-Tetrahydropyrrolo[3,4-c]pyrazole 12 4-tert-butyl-N-[5-(furan-2-ylcarbonyl)-1H,4H,5H,6H-pyrrolo[3,4-c]pyrazol-3-yl]benzamide | CHEMBL191816
TypeSmall organic molecule
Emp. Form.C21H22N4O3
Mol. Mass.378.4244
SMILESCC(C)(C)c1ccc(cc1)C(=O)Nc1[nH]nc2CN(Cc12)C(=O)c1ccco1