Reaction Details
TargetAurora kinase A
LigandBDBM12405
Substrate/Competitorn/a
Meas. Tech.ChEMBL_501648 (CHEMBL993738)
IC50 3±n/a nM
Citation Pollard, JRMortimore, M Discovery and development of aurora kinase inhibitors as anticancer agents. J Med Chem52:2629-51 (2009) 
 
Aurora kinase A
Name:Aurora kinase A
Type:Serine/threonine-protein kinase
Mol. Mass.:45830.98
Organism:Homo sapiens (Human)
Description:O14965
Residue:403
BDBM12405
NameBDBM12405
Synonyms:CHEMBL381724 quinazoline deriv. 3
TypeSmall organic molecule
Emp. Form.C27H29N7O4
Mol. Mass.515.5637
SMILESCOc1cc2c(Nc3cnc(NC(=O)c4ccccc4)nc3)ncnc2cc1OCCCN1CCOCC1