Reaction Details
TargetAurora kinase A
LigandBDBM50277831
Substrate/Competitorn/a
Meas. Tech.ChEMBL_501648 (CHEMBL993738)
IC50 11±n/a nM
Citation Pollard, JRMortimore, M Discovery and development of aurora kinase inhibitors as anticancer agents. J Med Chem52:2629-51 (2009) 
 
Aurora kinase A
Name:Aurora kinase A
Type:Serine/threonine-protein kinase
Mol. Mass.:45830.98
Organism:Homo sapiens (Human)
Description:O14965
Residue:403
BDBM50277831
NameBDBM50277831
Synonyms:5-(6-methoxy-7-(3-morpholinopropoxy)quinazolin-4-ylamino)-N-phenylthiophene-2-carboxamide | CHEMBL485337
TypeSmall organic molecule
Emp. Form.C27H29N5O4S
Mol. Mass.519.615
SMILESCOc1cc2c(Nc3ccc(s3)C(=O)Nc3ccccc3)ncnc2cc1OCCCN1CCOCC1