Reaction Details
TargetAurora kinase A
LigandBDBM26296
Substrate/Competitorn/a
Meas. Tech.ChEMBL_501648 (CHEMBL993738)
IC50 18±n/a nM
Citation Pollard, JRMortimore, M Discovery and development of aurora kinase inhibitors as anticancer agents. J Med Chem52:2629-51 (2009) 
 
Aurora kinase A
Name:Aurora kinase A
Type:Serine/threonine-protein kinase
Mol. Mass.:45830.98
Organism:Homo sapiens (Human)
Description:O14965
Residue:403
BDBM26296
NameBDBM26296
Synonyms:CHEMBL216053 pyrazoloquinazoline deriv., 30
TypeSmall organic molecule
Emp. Form.C29H35F2N7O4
Mol. Mass.583.6295
SMILESCOc1cc2c(Nc3cc(CC(=O)Nc4cccc(F)c4F)n[nH]3)ncnc2cc1OCCCN(CCO)CC(C)C