Reaction Details
TargetAurora kinase A
LigandBDBM26316
Substrate/Competitorn/a
Meas. Tech.ChEMBL_501648 (CHEMBL993738)
IC50>20000±n/a nM
Citation Pollard, JRMortimore, M Discovery and development of aurora kinase inhibitors as anticancer agents. J Med Chem52:2629-51 (2009) 
 
Aurora kinase A
Name:Aurora kinase A
Type:Serine/threonine-protein kinase
Mol. Mass.:45830.98
Organism:Homo sapiens (Human)
Description:O14965
Residue:403
BDBM26316
NameBDBM26316
Synonyms:3-[4-(2-{thieno[3,2-d]pyrimidin-4-ylamino}ethyl)-1,3-thiazol-2-yl]-1-[3-(trifluoromethyl)phenyl]urea thieno[3,2-d]pyrimidine analogue, 11
TypeSmall organic molecule
Emp. Form.C19H15F3N6OS2
Mol. Mass.464.487
SMILESFC(F)(F)c1cccc(NC(=O)Nc2nc(CCNc3ncnc4ccsc34)cs2)c1