Reaction Details
TargetAurora kinase B
LigandBDBM26297
Substrate/Competitorn/a
Meas. Tech.ChEMBL_501649 (CHEMBL993739)
IC50 7.5±n/a nM
Citation Pollard, JRMortimore, M Discovery and development of aurora kinase inhibitors as anticancer agents. J Med Chem52:2629-51 (2009) 
 
Aurora kinase B
Name:Aurora kinase B
Type:Protein
Mol. Mass.:39327.72
Organism:Homo sapiens (Human)
Description:Q96GD4
Residue:344
BDBM26297
NameBDBM26297
Synonyms:CHEMBL215322 pyrazoloquinazoline deriv., 31
TypeSmall organic molecule
Emp. Form.C26H29F2N7O3
Mol. Mass.525.5504
SMILESCCN(CCO)CCCOc1ccc2c(Nc3cc(CC(=O)Nc4cccc(F)c4F)n[nH]3)ncnc2c1