Reaction Details
TargetAurora kinase A
LigandBDBM50277638
Substrate/Competitorn/a
Meas. Tech.ChEMBL_501648 (CHEMBL993738)
IC50 3.7±n/a nM
Citation Pollard, JRMortimore, M Discovery and development of aurora kinase inhibitors as anticancer agents. J Med Chem52:2629-51 (2009) 
 
Aurora kinase A
Name:Aurora kinase A
Type:Serine/threonine-protein kinase
Mol. Mass.:45830.98
Organism:Homo sapiens (Human)
Description:O14965
Residue:403
BDBM50277638
NameBDBM50277638
Synonyms:CHEMBL482779 | N-(4-(4-(5-methyl-1H-pyrazol-3-ylamino)-6-(piperazin-1-yl)pyrimidin-2-ylthio)phenyl)propionamide
TypeSmall organic molecule
Emp. Form.C21H26N8OS
Mol. Mass.438.549
SMILESCCC(=O)Nc1ccc(Sc2nc(Nc3cc(C)n[nH]3)cc(n2)N2CCNCC2)cc1