Reaction Details
TargetAurora kinase B
LigandBDBM50277637
Substrate/Competitorn/a
Meas. Tech.ChEMBL_501649 (CHEMBL993739)
IC50 14±n/a nM
Citation Pollard, JRMortimore, M Discovery and development of aurora kinase inhibitors as anticancer agents. J Med Chem52:2629-51 (2009) 
 
Aurora kinase B
Name:Aurora kinase B
Type:Protein
Mol. Mass.:39327.72
Organism:Homo sapiens (Human)
Description:Q96GD4
Residue:344
BDBM50277637
NameBDBM50277637
Synonyms:CHEMBL482778 | N-(4-(4-(5-methyl-1H-pyrazol-3-ylamino)-6-morpholinopyrimidin-2-ylthio)phenyl)propionamide
TypeSmall organic molecule
Emp. Form.C21H25N7O2S
Mol. Mass.439.534
SMILESCCC(=O)Nc1ccc(Sc2nc(Nc3cc(C)n[nH]3)cc(n2)N2CCOCC2)cc1