Reaction Details
TargetAurora kinase B
LigandBDBM50277679
Substrate/Competitorn/a
Meas. Tech.ChEMBL_501649 (CHEMBL993739)
IC50 11±n/a nM
Citation Pollard, JRMortimore, M Discovery and development of aurora kinase inhibitors as anticancer agents. J Med Chem52:2629-51 (2009) 
 
Aurora kinase B
Name:Aurora kinase B
Type:Protein
Mol. Mass.:39327.72
Organism:Homo sapiens (Human)
Description:Q96GD4
Residue:344
BDBM50277679
NameBDBM50277679
Synonyms:CHEMBL484006 | N-(4-(4-(4-tert-butylpiperazin-1-yl)-6-(5-methyl-1H-pyrazol-3-ylamino)pyrimidin-2-ylthio)phenyl)propionamide
TypeSmall organic molecule
Emp. Form.C25H34N8OS
Mol. Mass.494.655
SMILESCCC(=O)Nc1ccc(Sc2nc(Nc3cc(C)n[nH]3)cc(n2)N2CCN(CC2)C(C)(C)C)cc1