Reaction Details
TargetCarbonic anhydrase 12
LigandBDBM50155551
Substrate/Competitorn/a
Meas. Tech.ChEMBL_544669 (CHEMBL1009246)
Ki 4.7±n/a nM
Citation Thiry, ARolin, SVullo, DFrankart, AScozzafava, ADogné, JMWouters, JSupuran, CTMasereel, B Indanesulfonamides as carbonic anhydrase inhibitors and anticonvulsant agents: structure-activity relationship and pharmacological evaluation. Eur J Med Chem43:2853-60 (2008) 
 
Carbonic anhydrase 12
Name:Carbonic anhydrase 12
Type:Enzyme
Mol. Mass.:39456.00
Organism:Homo sapiens (Human)
Description:Catalytic domain of human cloned isozyme was used in the assay
Residue:354
BDBM50155551
NameBDBM50155551
Synonyms:2-Acetylamino-indan-5-sulfonic acid; hydrate CHEMBL454461
TypeSmall organic molecule
Emp. Form.C11H13NO4S
Mol. Mass.255.29
SMILESCC(=O)NC1Cc2ccc(cc2C1)S(O)(=O)=O