Reaction Details
TargetCarbonic anhydrase 12
LigandBDBM11038
Substrate/Competitorn/a
Meas. Tech.ChEMBL_544669 (CHEMBL1009246)
Ki 52±n/a nM
Citation Thiry, ARolin, SVullo, DFrankart, AScozzafava, ADogné, JMWouters, JSupuran, CTMasereel, B Indanesulfonamides as carbonic anhydrase inhibitors and anticonvulsant agents: structure-activity relationship and pharmacological evaluation. Eur J Med Chem43:2853-60 (2008) 
 
Carbonic anhydrase 12
Name:Carbonic anhydrase 12
Type:Enzyme
Mol. Mass.:39456.00
Organism:Homo sapiens (Human)
Description:Catalytic domain of human cloned isozyme was used in the assay
Residue:354
BDBM11038
NameBDBM11038
Synonyms:2-butylamido-5-sulfonamidoindane Indanesulfonamide Derivative 12f | N-(5-sulfamoyl-2,3-dihydro-1H-inden-2-yl)pentanamide
TypeSmall organic molecule
Emp. Form.C14H20N2O3S
Mol. Mass.296.385
SMILESCCCCC(=O)NC1Cc2ccc(cc2C1)S(N)(=O)=O