Reaction Details
TargetCarbonic anhydrase 7
LigandBDBM11039
Substrate/Competitorn/a
Meas. Tech.ChEMBL_544671 (CHEMBL1009248)
Ki 1.9±n/a nM
Citation Thiry, ARolin, SVullo, DFrankart, AScozzafava, ADogné, JMWouters, JSupuran, CTMasereel, B Indanesulfonamides as carbonic anhydrase inhibitors and anticonvulsant agents: structure-activity relationship and pharmacological evaluation. Eur J Med Chem43:2853-60 (2008) 
 
Carbonic anhydrase 7
Name:Carbonic anhydrase 7
Type:Enzyme
Mol. Mass.:29664.11
Organism:Homo sapiens (Human)
Description:Human cloned isozyme.
Residue:264
BDBM11039
NameBDBM11039
Synonyms:2-nonylamido-5-sulfonamidoindane Indanesulfonamide Derivative 12g | N-(5-sulfamoyl-2,3-dihydro-1H-inden-2-yl)decanamide
TypeSmall organic molecule
Emp. Form.C19H30N2O3S
Mol. Mass.366.518
SMILESCCCCCCCCCC(=O)NC1Cc2ccc(cc2C1)S(N)(=O)=O