Reaction Details
TargetHeat shock protein HSP 90-beta
LigandBDBM15372
Substrate/Competitorn/a
Meas. Tech.ChEMBL_543937 (CHEMBL1020372)
IC50 25±n/a nM
Citation Taldone, TSun, WChiosis, G Discovery and development of heat shock protein 90 inhibitors. Bioorg Med Chem17:2225-35 (2009) 
 
Heat shock protein HSP 90-beta
Name:Heat shock protein HSP 90-beta
Type:Molecular Chaperone
Mol. Mass.:83229.45
Organism:Homo sapiens (Human)
Description:P08238
Residue:724
BDBM15372
NameBDBM15372
Synonyms:3-(5-chloro-2,4-dihydroxyphenyl)-N-ethyl-4-(4-methoxyphenyl)-1H-pyrazole-5-carboxamide Compound 11 VER-49009
TypeSmall organic molecule
Emp. Form.C19H18ClN3O4
Mol. Mass.387.817
SMILESCCNC(=O)c1[nH]nc(c1-c1ccc(OC)cc1)-c1cc(Cl)c(O)cc1O