Reaction Details
TargetHeat shock protein HSP 90-beta
LigandBDBM20751
Substrate/Competitorn/a
Meas. Tech.ChEMBL_543926 (CHEMBL1020361)
IC50 14±n/a nM
Citation Taldone, TSun, WChiosis, G Discovery and development of heat shock protein 90 inhibitors. Bioorg Med Chem17:2225-35 (2009) 
 
Heat shock protein HSP 90-beta
Name:Heat shock protein HSP 90-beta
Type:Molecular Chaperone
Mol. Mass.:83229.45
Organism:Homo sapiens (Human)
Description:P08238
Residue:724
BDBM20751
NameBDBM20751
Synonyms:9-[3-(tert-butylamino)propyl]-8-[(2-iodo-5-methoxyphenyl)sulfanyl]-9H-purin-6-amine CHEMBL199532
TypeSmall organic molecule
Emp. Form.C19H25IN6OS
Mol. Mass.512.411
SMILESCOc1ccc(I)c(Sc2nc3c(N)ncnc3n2CCCNC(C)(C)C)c1