Reaction Details
TargetInsulin-like growth factor 1 receptor
LigandBDBM50265869
Substrate/Competitorn/a
Meas. Tech.ChEMBL_540380 (CHEMBL1025723)
IC50 10±n/a nM
Citation Chamberlain, SDRedman, AMPatnaik, SBrickhouse, KChew, YCDeanda, FGerding, RLei, HMoorthy, GPatrick, MStevens, KLWilson, JWBrad Shotwell, J Optimization of a series of 4,6-bis-anilino-1H-pyrrolo[2,3-d]pyrimidine inhibitors of IGF-1R: elimination of an acid-mediated decomposition pathway. Bioorg Med Chem Lett19:373-7 (2008) 
 
Insulin-like growth factor 1 receptor
Name:Insulin-like growth factor 1 receptor
Type:Protein
Mol. Mass.:154776.79
Organism:Homo sapiens (Human)
Description:P08069
Residue:1367
BDBM50265869
NameBDBM50265869
Synonyms:3-(2-(1-(2-(dimethylamino)acetyl)-5-methoxyindolin-6-ylamino)-7H-pyrrolo[2,3-d]pyrimidin-4-ylamino)thiophene-2-carboxamide | CHEMBL514873
TypeSmall organic molecule
Emp. Form.C24H26N8O3S
Mol. Mass.506.58
SMILESCOc1cc2CCN(C(=O)CN(C)C)c2cc1Nc1nc(Nc2ccsc2C(N)=O)c2cc[nH]c2n1