Reaction Details
TargetInsulin-like growth factor 1 receptor
LigandBDBM50266295
Substrate/Competitorn/a
Meas. Tech.ChEMBL_540379 (CHEMBL1025722)
IC50 79±n/a nM
Citation Chamberlain, SDRedman, AMPatnaik, SBrickhouse, KChew, YCDeanda, FGerding, RLei, HMoorthy, GPatrick, MStevens, KLWilson, JWBrad Shotwell, J Optimization of a series of 4,6-bis-anilino-1H-pyrrolo[2,3-d]pyrimidine inhibitors of IGF-1R: elimination of an acid-mediated decomposition pathway. Bioorg Med Chem Lett19:373-7 (2008) 
 
Insulin-like growth factor 1 receptor
Name:Insulin-like growth factor 1 receptor
Type:Protein
Mol. Mass.:154776.79
Organism:Homo sapiens (Human)
Description:P08069
Residue:1367
BDBM50266295
NameBDBM50266295
Synonyms:2-(2-(4-(4-isobutylpiperazin-1-yl)-2-methoxyphenylamino)-7H-pyrrolo[2,3-d]pyrimidin-4-ylamino)benzonitrile | CHEMBL514577
TypeSmall organic molecule
Emp. Form.C28H32N8O
Mol. Mass.496.6067
SMILESCOc1cc(ccc1Nc1nc(Nc2ccccc2C#N)c2cc[nH]c2n1)N1CCN(CC(C)C)CC1