Reaction Details
TargetInsulin-like growth factor 1 receptor
LigandBDBM50266332
Substrate/Competitorn/a
Meas. Tech.ChEMBL_540379 (CHEMBL1025722)
IC50 250±n/a nM
Citation Chamberlain, SDRedman, AMPatnaik, SBrickhouse, KChew, YCDeanda, FGerding, RLei, HMoorthy, GPatrick, MStevens, KLWilson, JWBrad Shotwell, J Optimization of a series of 4,6-bis-anilino-1H-pyrrolo[2,3-d]pyrimidine inhibitors of IGF-1R: elimination of an acid-mediated decomposition pathway. Bioorg Med Chem Lett19:373-7 (2008) 
 
Insulin-like growth factor 1 receptor
Name:Insulin-like growth factor 1 receptor
Type:Protein
Mol. Mass.:154776.79
Organism:Homo sapiens (Human)
Description:P08069
Residue:1367
BDBM50266332
NameBDBM50266332
Synonyms:CHEMBL458438 | N2-(4-(4-isopropylpiperazin-1-yl)-2-methoxyphenyl)-N4-(quinolin-5-yl)-7H-pyrrolo[2,3-d]pyrimidine-2,4-diamine
TypeSmall organic molecule
Emp. Form.C29H32N8O
Mol. Mass.508.6174
SMILESCOc1cc(ccc1Nc1nc(Nc2cccc3ncccc23)c2cc[nH]c2n1)N1CCN(CC1)C(C)C