Reaction Details
TargetCannabinoid receptor 2
LigandBDBM50258526
Substrate/Competitorn/a
Meas. Tech.ChEMBL_523689 (CHEMBL998034)
Ki 31±n/a nM
Citation Manera, CSaccomanni, GAdinolfi, BBenetti, VLigresti, ACascio, MGTuccinardi, TLucchesi, VMartinelli, ANieri, PMasini, EDi Marzo, VFerrarini, PL Rational design, synthesis, and pharmacological properties of new 1,8-naphthyridin-2(1H)-on-3-carboxamide derivatives as highly selective cannabinoid-2 receptor agonists. J Med Chem52:3644-51 (2009) 
 
Cannabinoid receptor 2
Name:Cannabinoid receptor 2
Type:G Protein-Coupled Receptor (GPCR)
Mol. Mass.:39690.94
Organism:Homo sapiens (Human)
Description:P34972
Residue:360
BDBM50258526
NameBDBM50258526
Synonyms:CHEMBL446993 | N-Cyclohexyl-1-benzyl-1,8-naphthyridin-2(1H)-on-3-carboxamide
TypeSmall organic molecule
Emp. Form.C22H23N3O2
Mol. Mass.361.4369
SMILESO=C(NC1CCCCC1)c1cc2cccnc2n(Cc2ccccc2)c1=O