Reaction Details
TargetCannabinoid receptor 1
LigandBDBM50258653
Substrate/Competitorn/a
Meas. Tech.ChEMBL_523688 (CHEMBL997203)
Ki 300±n/a nM
Citation Manera, CSaccomanni, GAdinolfi, BBenetti, VLigresti, ACascio, MGTuccinardi, TLucchesi, VMartinelli, ANieri, PMasini, EDi Marzo, VFerrarini, PL Rational design, synthesis, and pharmacological properties of new 1,8-naphthyridin-2(1H)-on-3-carboxamide derivatives as highly selective cannabinoid-2 receptor agonists. J Med Chem52:3644-51 (2009) 
 
Cannabinoid receptor 1
Name:Cannabinoid receptor 1
Type:G Protein-Coupled Receptor (GPCR)
Mol. Mass.:52868.96
Organism:Homo sapiens (Human)
Description:P21554
Residue:472
BDBM50258653
NameBDBM50258653
Synonyms:CHEMBL512063 | trans-N-(4-Methylcyclohexyl)-1-(p-fluorobenzyl)-1,8-naphthyridin-2(1H)-on-3-carboxamide
TypeSmall organic molecule
Emp. Form.C23H24FN3O2
Mol. Mass.393.454
SMILESC[C@H]1CC[C@@H](CC1)NC(=O)c1cc2cccnc2n(Cc2ccc(F)cc2)c1=O