Reaction Details
TargetCannabinoid receptor 1
LigandBDBM50180022
Substrate/Competitorn/a
Meas. Tech.ChEMBL_523688 (CHEMBL997203)
Ki 437±n/a nM
Citation Manera, CSaccomanni, GAdinolfi, BBenetti, VLigresti, ACascio, MGTuccinardi, TLucchesi, VMartinelli, ANieri, PMasini, EDi Marzo, VFerrarini, PL Rational design, synthesis, and pharmacological properties of new 1,8-naphthyridin-2(1H)-on-3-carboxamide derivatives as highly selective cannabinoid-2 receptor agonists. J Med Chem52:3644-51 (2009) 
 
Cannabinoid receptor 1
Name:Cannabinoid receptor 1
Type:G Protein-Coupled Receptor (GPCR)
Mol. Mass.:52868.96
Organism:Homo sapiens (Human)
Description:P21554
Residue:472
BDBM50180022
NameBDBM50180022
Synonyms:5-(4-chloro-3-methyl-phenyl)-1-(4-methyl-benzyl)-1H-pyrazole-3-carboxylic acid (1,3,3-trimethyl-bicyclo[2.2.1]hept-2-yl)-amide | CHEMBL381689
TypeSmall organic molecule
Emp. Form.C29H34ClN3O
Mol. Mass.476.053
SMILESCc1ccc(Cn2nc(cc2-c2ccc(Cl)c(C)c2)C(=O)NC2C3(C)CCC(C3)C2(C)C)cc1