Reaction Details
TargetCannabinoid receptor 1
LigandBDBM50258572
Substrate/Competitorn/a
Meas. Tech.ChEMBL_523688 (CHEMBL997203)
Ki 960±n/a nM
Citation Manera, CSaccomanni, GAdinolfi, BBenetti, VLigresti, ACascio, MGTuccinardi, TLucchesi, VMartinelli, ANieri, PMasini, EDi Marzo, VFerrarini, PL Rational design, synthesis, and pharmacological properties of new 1,8-naphthyridin-2(1H)-on-3-carboxamide derivatives as highly selective cannabinoid-2 receptor agonists. J Med Chem52:3644-51 (2009) 
 
Cannabinoid receptor 1
Name:Cannabinoid receptor 1
Type:G Protein-Coupled Receptor (GPCR)
Mol. Mass.:52868.96
Organism:Homo sapiens (Human)
Description:P21554
Residue:472
BDBM50258572
NameBDBM50258572
Synonyms:CHEMBL511253 | N-Cycloheptyl-1-benzyl-1,8-naphthyridin-2(1H)-on-3-carboxamide
TypeSmall organic molecule
Emp. Form.C23H25N3O2
Mol. Mass.375.4635
SMILESO=C(NC1CCCCCC1)c1cc2cccnc2n(Cc2ccccc2)c1=O