Reaction Details
TargetP2Y purinoceptor 12
LigandBDBM50268873
Substrate/Competitorn/a
Meas. Tech.ChEMBL_523462 (CHEMBL995340)
Ki>10000±n/a nM
Citation Baqi, YAtzler, KKöse, MGlänzel, MMüller, CE High-affinity, non-nucleotide-derived competitive antagonists of platelet P2Y12 receptors. J Med Chem52:3784-93 (2009) 
 
P2Y purinoceptor 12
Name:P2Y purinoceptor 12
Type:Enzyme
Mol. Mass.:39458.48
Organism:Homo sapiens (Human)
Description:Q9H244
Residue:342
BDBM50268873
NameBDBM50268873
Synonyms:CHEMBL495796 Sodium 1-amino-4-(3-amino-2,4,6-trimethylphenylamino)-9,10-dioxo-9,10-dihydroanthracene-2-sulfonate
TypeSmall organic molecule
Emp. Form.C23H20N3O5S
Mol. Mass.450.488
SMILESCc1cc(C)c(Nc2cc(c(N)c3C(=O)c4ccccc4C(=O)c23)S([O-])(=O)=O)c(C)c1N