Reaction Details
TargetP2Y purinoceptor 12
LigandBDBM50268966
Substrate/Competitorn/a
Meas. Tech.ChEMBL_523462 (CHEMBL995340)
Ki 10000±n/a nM
Citation Baqi, YAtzler, KKöse, MGlänzel, MMüller, CE High-affinity, non-nucleotide-derived competitive antagonists of platelet P2Y12 receptors. J Med Chem52:3784-93 (2009) 
 
P2Y purinoceptor 12
Name:P2Y purinoceptor 12
Type:Enzyme
Mol. Mass.:39458.48
Organism:Homo sapiens (Human)
Description:Q9H244
Residue:342
BDBM50268966
NameBDBM50268966
Synonyms:CHEMBL496229 | Sodium 1-Amino-4-[4-([1,3]diazine-2-ylamino)phenylamino]-9,10-dioxo-9,10-dihydroanthracene-2-sulfonate
TypeSmall organic molecule
Emp. Form.C24H16N5O5S
Mol. Mass.486.48
SMILESNc1c(cc(Nc2ccc(Nc3ncccn3)cc2)c2C(=O)c3ccccc3C(=O)c12)S([O-])(=O)=O