Reaction Details
TargetP2Y purinoceptor 12
LigandBDBM50333877
Substrate/Competitorn/a
Meas. Tech.ChEMBL_523462 (CHEMBL995340)
Ki>10000±n/a nM
Citation Baqi, YAtzler, KKöse, MGlänzel, MMüller, CE High-affinity, non-nucleotide-derived competitive antagonists of platelet P2Y12 receptors. J Med Chem52:3784-93 (2009) 
 
P2Y purinoceptor 12
Name:P2Y purinoceptor 12
Type:Enzyme
Mol. Mass.:39458.48
Organism:Homo sapiens (Human)
Description:Q9H244
Residue:342
BDBM50333877
NameBDBM50333877
Synonyms:1,8-Dihydroxy-3-methyl-anthraquinone 1,8-dihydroxy-3-methylanthracene-9,10-dione chrysophanol
TypeSmall organic molecule
Emp. Form.C15H12O4
Mol. Mass.256.2534
SMILESCc1cc(O)c2c(O)c3c(O)cccc3c(O)c2c1