Reaction Details
TargetP2Y purinoceptor 12
LigandBDBM50269015
Substrate/Competitorn/a
Meas. Tech.ChEMBL_523462 (CHEMBL995340)
Ki>10000±n/a nM
Citation Baqi, YAtzler, KKöse, MGlänzel, MMüller, CE High-affinity, non-nucleotide-derived competitive antagonists of platelet P2Y12 receptors. J Med Chem52:3784-93 (2009) 
 
P2Y purinoceptor 12
Name:P2Y purinoceptor 12
Type:Enzyme
Mol. Mass.:39458.48
Organism:Homo sapiens (Human)
Description:Q9H244
Residue:342
BDBM50269015
NameBDBM50269015
Synonyms:CHEMBL497000 | rhein methylester
TypeSmall organic molecule
Emp. Form.C16H10O6
Mol. Mass.298.247
SMILESCOC(=O)c1cc(O)c2C(=O)c3c(O)cccc3C(=O)c2c1