Reaction Details
TargetP2Y purinoceptor 12
LigandBDBM50368781
Substrate/Competitorn/a
Meas. Tech.ChEMBL_523462 (CHEMBL995340)
Ki>10000±n/a nM
Citation Baqi, YAtzler, KKöse, MGlänzel, MMüller, CE High-affinity, non-nucleotide-derived competitive antagonists of platelet P2Y12 receptors. J Med Chem52:3784-93 (2009) 
 
P2Y purinoceptor 12
Name:P2Y purinoceptor 12
Type:Enzyme
Mol. Mass.:39458.48
Organism:Homo sapiens (Human)
Description:Q9H244
Residue:342
BDBM50368781
NameBDBM50368781
Synonyms:Achromycin Liquamycin TETRACYCLINE
TypeSmall organic molecule
Emp. Form.C22H24N2O8
Mol. Mass.444.4346
SMILESCN(C)[C@H]1[C@@H]2C[C@H]3C(C(=O)c4c(O)cccc4[C@@]3(C)O)C(=O)[C@]2(O)C(=O)C(C(N)=O)C1=O