Reaction Details
TargetP2Y purinoceptor 12
LigandBDBM50269014
Substrate/Competitorn/a
Meas. Tech.ChEMBL_523462 (CHEMBL995340)
Ki>10000±n/a nM
Citation Baqi, YAtzler, KKöse, MGlänzel, MMüller, CE High-affinity, non-nucleotide-derived competitive antagonists of platelet P2Y12 receptors. J Med Chem52:3784-93 (2009) 
 
P2Y purinoceptor 12
Name:P2Y purinoceptor 12
Type:Enzyme
Mol. Mass.:39458.48
Organism:Homo sapiens (Human)
Description:Q9H244
Residue:342
BDBM50269014
NameBDBM50269014
Synonyms:CHEMBL496999 | frangulin B
TypeSmall organic molecule
Emp. Form.C20H18O9
Mol. Mass.402.3515
SMILESCc1cc(O)c2C(=O)c3c(O)cc(O[C@@H]4OC[C@](O)(CO)[C@H]4O)cc3C(=O)c2c1